{"text_format":"1","workbook":"xlsx","n_sheets":4,"sheets":["TempO Answers","TempO Results","Sorted Results","Sorted Table"],"not_rendered":{"charts":0,"images":0,"macros":1,"external_links":0,"defined_names":23,"comments":0,"pivot_tables":0},"unopened":[],"bounds":{"document_bytes":16777216,"sheet_cells":100000,"rows_first":2000,"rows_last":500,"rows_between":2000,"halvings":0,"cell_chars":16384,"cell_head_chars":4096},"cells_cut":0,"cells_raw":0,"read":"whole","date_system":"1900"}

{"sheet":"TempO Answers","index":0,"n_rows":24,"n_cols":30,"rows_kept":24,"cut":false,"hidden":false,"merged":[[10,1,10,4],[10,17,10,20],[10,13,10,16],[10,9,10,12],[10,5,10,8]]}
["Type Event Name here",null,null,null,null,null,null,null,null,null,null,null,null,null,null,null,null,null,null,null,null,null,null,null,null,null,null,null,null,"DO NOT EDIT"]
["Type Event Date here",null,null,null,null,null,null,null,null,null,null,null,null,null,null,null,null,null,null,null,null,null,null,null,null,null,null,null,null,"Permitted Answers:"]
[null,null,null,null,null,null,null,null,null,null,null,null,null,null,null,null,null,null,null,null,null,null,null,null,null,null,null,null,null,"A"]
["Press the Enter or Tab keys to move to the next box.  The Home key takes you back to the top.",null,null,null,null,null,null,null,null,null,null,null,null,null,null,null,null,null,null,null,null,null,null,null,null,null,null,null,null,"B"]
["For each problem, enter A-F, or Z  (either upper or lower case).  Enter an X if the problem is voided.",null,null,null,null,null,null,null,null,null,null,null,null,null,null,null,null,null,null,null,null,null,null,null,null,null,null,null,null,"C"]
[null,null,null,null,null,null,null,null,null,null,null,null,null,null,null,null,null,null,null,null,null,null,null,null,null,null,null,null,null,"D"]
[null,30,"=","time (secs) allowed per problem",null,null,null,null,null,null,null,null,null,30,"=","penalty (secs) per incorrect answer",null,null,null,null,null,null,null,null,null,null,null,null,null,"E"]
[null,4,"=","problems per station",null,null,null,null,null,null,null,null,null,null,null,null,null,null,null,null,null,null,null,null,null,null,null,null,null,"F"]
[null,{"$f":"B8*B7","v":120},"=","time (secs) allowed per station",null,null,null,null,null,null,null,null,null,null,null,null,null,null,null,null,null,null,null,null,null,null,null,null,null,"Z"]
[null,null,null,null,null,null,null,null,null,null,null,null,null,null,null,null,null,null,null,null,null,null,null,null,null,null,null,null,null,"X"]
[null,"Station 1",null,null,null,"Station 2",null,null,null,"Station 3",null,null,null,"Station 4",null,null,null,"Station 5"]
[null,1,2,3,4,5,6,7,8,9,10,11,12,13,14,15,16,17,18,19,20]
["Stn:Prob","1:1","1:2","1:3","1:4","2:1","2:2","2:3","2:4","3:1","3:2","3:3","3:4","4:1","4:2","4:3","4:4","5:1","5:2","5:3","5:4"]
["Prob No.",1,2,3,4,5,6,7,8,9,10,11,12,13,14,15,16,17,18,19,20]
["Answer"]
[]
["If you cannot see the Answers, and/or want to edit them, click the Show button below.",null,null,null,null,null,null,null,null,null,null,null,null,null,null,null,null,null,null,null,null,null,null,"Total problems:",20]
[null,null,null,null,null,null,null,null,null,null,null,null,null,null,null,null,null,null,null,null,null,null,null,"No of voided problems ( X's):",{"$f":"COUNTIF(AnsRow,\"X\")","v":0}]
[null,"Click to make Answers visible:",null,null,null,null,null,null,null,null,null,null,null,null,null,null,null,null,null,null,null,null,null,"Non-voided problems:",{"$f":"Y17-Y18","v":20}]
[]
{"$rows_left_out":5}
{"sheet":"TempO Results","index":1,"n_rows":139,"n_cols":43,"rows_kept":139,"cut":false,"hidden":false,"merged":[[3,0,5,0],[4,37,4,42],[3,6,5,6],[0,1,0,9],[3,4,5,4],[3,5,5,5],[3,11,3,15],[3,16,3,20],[3,21,3,25],[3,26,3,30],[3,31,3,35],[1,1,1,9]]}
[null,{"$f":"T('TempO Answers'!A1)","v":"Type Event Name here"},null,null,null,null,null,null,null,null,"Press the Enter or Tab keys to move to the next box.  The Home key takes you back to the top.",null,null,null,null,null,null,null,null,null,null,null,null,null,null,null,null,null,null,null,null,null,null,null,null,null,null,"Calculation cols: DO NOT EDIT"]
[null,{"$f":"T('TempO Answers'!A2)","v":"Type Event Date here"},null,null,null,null,null,null,null,null,"For each problem, enter A-F, or Z  (either upper or lower case).  Incorrect answers appear in Red font."]
[null,null,null,null,null,null,null,null,null,null,"If two (or more) answers have been given, enter both letters, e.g. BC.  If no answer given, leave blank.",null,null,null,null,null,null,null,null,null,null,null,null,null,null,null,null,null,null,null,null,null,null,null,null,null,null,"Max station time:",null,null,null,{"$f":"'TempO Answers'!B9","v":120},"secs"]
["Entry number",null,null,null,"Nation","No. Correct","No. Incorrect",null,null,null,null,"Station 1",null,null,null,null,"Station 2",null,null,null,null,"Station 3",null,null,null,null,"Station 4",null,null,null,null,"Station 5"]
[null,null,null,null,null,null,null,"Agg.","Penal",null,null,{"$f":"T('TempO Answers'!B15)","v":""},{"$f":"T('TempO Answers'!C15)","v":""},{"$f":"T('TempO Answers'!D15)","v":""},{"$f":"T('TempO Answers'!E15)","v":""},null,{"$f":"T('TempO Answers'!F15)","v":""},{"$f":"T('TempO Answers'!G15)","v":""},{"$f":"T('TempO Answers'!H15)","v":""},{"$f":"T('TempO Answers'!I15)","v":""},null,{"$f":"T('TempO Answers'!J15)","v":""},{"$f":"T('TempO Answers'!K15)","v":""},{"$f":"T('TempO Answers'!L15)","v":""},{"$f":"T('TempO Answers'!M15)","v":""},null,{"$f":"T('TempO Answers'!N15)","v":""},{"$f":"T('TempO Answers'!O15)","v":""},{"$f":"T('TempO Answers'!P15)","v":""},{"$f":"T('TempO Answers'!Q15)","v":""},null,{"$f":"T('TempO Answers'!R15)","v":""},{"$f":"T('TempO Answers'!S15)","v":""},{"$f":"T('TempO Answers'!T15)","v":""},{"$f":"T('TempO Answers'!U15)","v":""},null,null,"No. Correct"]
[null,"Rank","Name","Club",null,null,null,"Times (sec)","-ties (secs)","Result (sec)",null,1,2,3,4,"Time (sec)",5,6,7,8,"Time (sec)",9,10,11,12,"Time (sec)",13,14,15,16,"Time (sec)",17,18,19,20,"Time (sec)","  Warning message column","S1","S2","S3","S4","S5"]
[1,{"$f":"RANK(J7,$J$7:$J$138,1)","v":1},null,null,null,{"$f":"IF(H7<0.5,0,SUM(AL7:AP7))","v":0},{"$f":"'TempO Answers'!$Y$19-F7","v":20},{"$f":"SUM(AJ7,AE7,Z7,U7,P7)","v":0},{"$f":"G7*'TempO Answers'!$N$7","v":600},{"$f":"IF(H7<0.1,9999,H7+I7)","v":9999},null,null,null,null,null,null,null,null,null,null,null,null,null,null,null,null,null,null,null,null,null,null,null,null,null,null,{"$f":"IF(AND(H7>0.1,OR(P7<0.1,U7<0.1,Z7<0.1,AE7<0.1,AJ7<0.1)),\"  Warning:  Station times incomplete\",IF(ISNA(HLOOKUP(\"X\",L7:AI7,1,FALSE)),\"\",\"  Error: X answer is not allowed \"))","v":""},{"$f":"IF(L7='TempO Answers'!B$15,1,0)+IF(M7='TempO Answers'!C$15,1,0)+IF(N7='TempO Answers'!D$15,1,0)+IF(O7='TempO Answers'!E$15,1,0)","v":4},{"$f":"IF(Q7='TempO Answers'!F$15,1,0)+IF(R7='TempO Answers'!G$15,1,0)+IF(S7='TempO Answers'!H$15,1,0)+IF(T7='TempO Answers'!I$15,1,0)","v":4},{"$f":"IF(V7='TempO Answers'!J$15,1,0)+IF(W7='TempO Answers'!K$15,1,0)+IF(X7='TempO Answers'!L$15,1,0)+IF(Y7='TempO Answers'!M$15,1,0)","v":4},{"$f":"IF(AA7='TempO Answers'!N$15,1,0)+IF(AB7='TempO Answers'!O$15,1,0)+IF(AC7='TempO Answers'!P$15,1,0)+IF(AD7='TempO Answers'!Q$15,1,0)","v":4},{"$f":"IF(AF7='TempO Answers'!R$15,1,0)+IF(AG7='TempO Answers'!S$15,1,0)+IF(AH7='TempO Answers'!T$15,1,0)+IF(AI7='TempO Answers'!U$15,1,0)","v":4}]
[2,1,null,null,null,{"$f":"IF(H8<0.5,0,SUM(AL8:AP8))","v":0},{"$f":"'TempO Answers'!$Y$19-F8","v":20},{"$f":"SUM(AJ8,AE8,Z8,U8,P8)","v":0},{"$f":"G8*'TempO Answers'!$N$7","v":600},9999,null,null,null,null,null,null,null,null,null,null,null,null,null,null,null,null,null,null,null,null,null,null,null,null,null,null,{"$f":"IF(AND(H8>0.1,OR(P8<0.1,U8<0.1,Z8<0.1,AE8<0.1,AJ8<0.1)),\"  Warning:  Station times incomplete\",IF(ISNA(HLOOKUP(\"X\",L8:AI8,1,FALSE)),\"\",\"  Error: X answer is not allowed \"))","v":""},{"$f":"IF(L8='TempO Answers'!B$15,1,0)+IF(M8='TempO Answers'!C$15,1,0)+IF(N8='TempO Answers'!D$15,1,0)+IF(O8='TempO Answers'!E$15,1,0)","v":4},{"$f":"IF(Q8='TempO Answers'!F$15,1,0)+IF(R8='TempO Answers'!G$15,1,0)+IF(S8='TempO Answers'!H$15,1,0)+IF(T8='TempO Answers'!I$15,1,0)","v":4},{"$f":"IF(V8='TempO Answers'!J$15,1,0)+IF(W8='TempO Answers'!K$15,1,0)+IF(X8='TempO Answers'!L$15,1,0)+IF(Y8='TempO Answers'!M$15,1,0)","v":4},{"$f":"IF(AA8='TempO Answers'!N$15,1,0)+IF(AB8='TempO Answers'!O$15,1,0)+IF(AC8='TempO Answers'!P$15,1,0)+IF(AD8='TempO Answers'!Q$15,1,0)","v":4},{"$f":"IF(AF8='TempO Answers'!R$15,1,0)+IF(AG8='TempO Answers'!S$15,1,0)+IF(AH8='TempO Answers'!T$15,1,0)+IF(AI8='TempO Answers'!U$15,1,0)","v":4}]
[3,1,null,null,null,0,{"$f":"'TempO Answers'!$Y$19-F9","v":20},0,{"$f":"G9*'TempO Answers'!$N$7","v":600},9999,null,null,null,null,null,null,null,null,null,null,null,null,null,null,null,null,null,null,null,null,null,null,null,null,null,null,"",{"$f":"IF(L9='TempO Answers'!B$15,1,0)+IF(M9='TempO Answers'!C$15,1,0)+IF(N9='TempO Answers'!D$15,1,0)+IF(O9='TempO Answers'!E$15,1,0)","v":4},{"$f":"IF(Q9='TempO Answers'!F$15,1,0)+IF(R9='TempO Answers'!G$15,1,0)+IF(S9='TempO Answers'!H$15,1,0)+IF(T9='TempO Answers'!I$15,1,0)","v":4},{"$f":"IF(V9='TempO Answers'!J$15,1,0)+IF(W9='TempO Answers'!K$15,1,0)+IF(X9='TempO Answers'!L$15,1,0)+IF(Y9='TempO Answers'!M$15,1,0)","v":4},{"$f":"IF(AA9='TempO Answers'!N$15,1,0)+IF(AB9='TempO Answers'!O$15,1,0)+IF(AC9='TempO Answers'!P$15,1,0)+IF(AD9='TempO Answers'!Q$15,1,0)","v":4},{"$f":"IF(AF9='TempO Answers'!R$15,1,0)+IF(AG9='TempO Answers'!S$15,1,0)+IF(AH9='TempO Answers'!T$15,1,0)+IF(AI9='TempO Answers'!U$15,1,0)","v":4}]
[4,1,null,null,null,0,{"$f":"'TempO Answers'!$Y$19-F10","v":20},0,{"$f":"G10*'TempO Answers'!$N$7","v":600},9999,null,null,null,null,null,null,null,null,null,null,null,null,null,null,null,null,null,null,null,null,null,null,null,null,null,null,"",{"$f":"IF(L10='TempO Answers'!B$15,1,0)+IF(M10='TempO Answers'!C$15,1,0)+IF(N10='TempO Answers'!D$15,1,0)+IF(O10='TempO Answers'!E$15,1,0)","v":4},{"$f":"IF(Q10='TempO Answers'!F$15,1,0)+IF(R10='TempO Answers'!G$15,1,0)+IF(S10='TempO Answers'!H$15,1,0)+IF(T10='TempO Answers'!I$15,1,0)","v":4},{"$f":"IF(V10='TempO Answers'!J$15,1,0)+IF(W10='TempO Answers'!K$15,1,0)+IF(X10='TempO Answers'!L$15,1,0)+IF(Y10='TempO Answers'!M$15,1,0)","v":4},{"$f":"IF(AA10='TempO Answers'!N$15,1,0)+IF(AB10='TempO Answers'!O$15,1,0)+IF(AC10='TempO Answers'!P$15,1,0)+IF(AD10='TempO Answers'!Q$15,1,0)","v":4},{"$f":"IF(AF10='TempO Answers'!R$15,1,0)+IF(AG10='TempO Answers'!S$15,1,0)+IF(AH10='TempO Answers'!T$15,1,0)+IF(AI10='TempO Answers'!U$15,1,0)","v":4}]
[5,1,null,null,null,0,{"$f":"'TempO Answers'!$Y$19-F11","v":20},0,{"$f":"G11*'TempO Answers'!$N$7","v":600},9999,null,null,null,null,null,null,null,null,null,null,null,null,null,null,null,null,null,null,null,null,null,null,null,null,null,null,"",{"$f":"IF(L11='TempO Answers'!B$15,1,0)+IF(M11='TempO Answers'!C$15,1,0)+IF(N11='TempO Answers'!D$15,1,0)+IF(O11='TempO Answers'!E$15,1,0)","v":4},{"$f":"IF(Q11='TempO Answers'!F$15,1,0)+IF(R11='TempO Answers'!G$15,1,0)+IF(S11='TempO Answers'!H$15,1,0)+IF(T11='TempO Answers'!I$15,1,0)","v":4},{"$f":"IF(V11='TempO Answers'!J$15,1,0)+IF(W11='TempO Answers'!K$15,1,0)+IF(X11='TempO Answers'!L$15,1,0)+IF(Y11='TempO Answers'!M$15,1,0)","v":4},{"$f":"IF(AA11='TempO Answers'!N$15,1,0)+IF(AB11='TempO Answers'!O$15,1,0)+IF(AC11='TempO Answers'!P$15,1,0)+IF(AD11='TempO Answers'!Q$15,1,0)","v":4},{"$f":"IF(AF11='TempO Answers'!R$15,1,0)+IF(AG11='TempO Answers'!S$15,1,0)+IF(AH11='TempO Answers'!T$15,1,0)+IF(AI11='TempO Answers'!U$15,1,0)","v":4}]
[6,1,null,null,null,0,{"$f":"'TempO Answers'!$Y$19-F12","v":20},0,{"$f":"G12*'TempO Answers'!$N$7","v":600},9999,null,null,null,null,null,null,null,null,null,null,null,null,null,null,null,null,null,null,null,null,null,null,null,null,null,null,"",{"$f":"IF(L12='TempO Answers'!B$15,1,0)+IF(M12='TempO Answers'!C$15,1,0)+IF(N12='TempO Answers'!D$15,1,0)+IF(O12='TempO Answers'!E$15,1,0)","v":4},{"$f":"IF(Q12='TempO Answers'!F$15,1,0)+IF(R12='TempO Answers'!G$15,1,0)+IF(S12='TempO Answers'!H$15,1,0)+IF(T12='TempO Answers'!I$15,1,0)","v":4},{"$f":"IF(V12='TempO Answers'!J$15,1,0)+IF(W12='TempO Answers'!K$15,1,0)+IF(X12='TempO Answers'!L$15,1,0)+IF(Y12='TempO Answers'!M$15,1,0)","v":4},{"$f":"IF(AA12='TempO Answers'!N$15,1,0)+IF(AB12='TempO Answers'!O$15,1,0)+IF(AC12='TempO Answers'!P$15,1,0)+IF(AD12='TempO Answers'!Q$15,1,0)","v":4},{"$f":"IF(AF12='TempO Answers'!R$15,1,0)+IF(AG12='TempO Answers'!S$15,1,0)+IF(AH12='TempO Answers'!T$15,1,0)+IF(AI12='TempO Answers'!U$15,1,0)","v":4}]
[7,1,null,null,null,0,{"$f":"'TempO Answers'!$Y$19-F13","v":20},0,{"$f":"G13*'TempO Answers'!$N$7","v":600},9999,null,null,null,null,null,null,null,null,null,null,null,null,null,null,null,null,null,null,null,null,null,null,null,null,null,null,"",{"$f":"IF(L13='TempO Answers'!B$15,1,0)+IF(M13='TempO Answers'!C$15,1,0)+IF(N13='TempO Answers'!D$15,1,0)+IF(O13='TempO Answers'!E$15,1,0)","v":4},{"$f":"IF(Q13='TempO Answers'!F$15,1,0)+IF(R13='TempO Answers'!G$15,1,0)+IF(S13='TempO Answers'!H$15,1,0)+IF(T13='TempO Answers'!I$15,1,0)","v":4},{"$f":"IF(V13='TempO Answers'!J$15,1,0)+IF(W13='TempO Answers'!K$15,1,0)+IF(X13='TempO Answers'!L$15,1,0)+IF(Y13='TempO Answers'!M$15,1,0)","v":4},{"$f":"IF(AA13='TempO Answers'!N$15,1,0)+IF(AB13='TempO Answers'!O$15,1,0)+IF(AC13='TempO Answers'!P$15,1,0)+IF(AD13='TempO Answers'!Q$15,1,0)","v":4},{"$f":"IF(AF13='TempO Answers'!R$15,1,0)+IF(AG13='TempO Answers'!S$15,1,0)+IF(AH13='TempO Answers'!T$15,1,0)+IF(AI13='TempO Answers'!U$15,1,0)","v":4}]
[8,1,null,null,null,0,{"$f":"'TempO Answers'!$Y$19-F14","v":20},0,{"$f":"G14*'TempO Answers'!$N$7","v":600},9999,null,null,null,null,null,null,null,null,null,null,null,null,null,null,null,null,null,null,null,null,null,null,null,null,null,null,"",{"$f":"IF(L14='TempO Answers'!B$15,1,0)+IF(M14='TempO Answers'!C$15,1,0)+IF(N14='TempO Answers'!D$15,1,0)+IF(O14='TempO Answers'!E$15,1,0)","v":4},{"$f":"IF(Q14='TempO Answers'!F$15,1,0)+IF(R14='TempO Answers'!G$15,1,0)+IF(S14='TempO Answers'!H$15,1,0)+IF(T14='TempO Answers'!I$15,1,0)","v":4},{"$f":"IF(V14='TempO Answers'!J$15,1,0)+IF(W14='TempO Answers'!K$15,1,0)+IF(X14='TempO Answers'!L$15,1,0)+IF(Y14='TempO Answers'!M$15,1,0)","v":4},{"$f":"IF(AA14='TempO Answers'!N$15,1,0)+IF(AB14='TempO Answers'!O$15,1,0)+IF(AC14='TempO Answers'!P$15,1,0)+IF(AD14='TempO Answers'!Q$15,1,0)","v":4},{"$f":"IF(AF14='TempO Answers'!R$15,1,0)+IF(AG14='TempO Answers'!S$15,1,0)+IF(AH14='TempO Answers'!T$15,1,0)+IF(AI14='TempO Answers'!U$15,1,0)","v":4}]
[9,1,null,null,null,0,{"$f":"'TempO Answers'!$Y$19-F15","v":20},0,{"$f":"G15*'TempO Answers'!$N$7","v":600},9999,null,null,null,null,null,null,null,null,null,null,null,null,null,null,null,null,null,null,null,null,null,null,null,null,null,null,"",{"$f":"IF(L15='TempO Answers'!B$15,1,0)+IF(M15='TempO Answers'!C$15,1,0)+IF(N15='TempO Answers'!D$15,1,0)+IF(O15='TempO Answers'!E$15,1,0)","v":4},{"$f":"IF(Q15='TempO Answers'!F$15,1,0)+IF(R15='TempO Answers'!G$15,1,0)+IF(S15='TempO Answers'!H$15,1,0)+IF(T15='TempO Answers'!I$15,1,0)","v":4},{"$f":"IF(V15='TempO Answers'!J$15,1,0)+IF(W15='TempO Answers'!K$15,1,0)+IF(X15='TempO Answers'!L$15,1,0)+IF(Y15='TempO Answers'!M$15,1,0)","v":4},{"$f":"IF(AA15='TempO Answers'!N$15,1,0)+IF(AB15='TempO Answers'!O$15,1,0)+IF(AC15='TempO Answers'!P$15,1,0)+IF(AD15='TempO Answers'!Q$15,1,0)","v":4},{"$f":"IF(AF15='TempO Answers'!R$15,1,0)+IF(AG15='TempO Answers'!S$15,1,0)+IF(AH15='TempO Answers'!T$15,1,0)+IF(AI15='TempO Answers'!U$15,1,0)","v":4}]
[10,1,null,null,null,0,{"$f":"'TempO Answers'!$Y$19-F16","v":20},0,{"$f":"G16*'TempO Answers'!$N$7","v":600},9999,null,null,null,null,null,null,null,null,null,null,null,null,null,null,null,null,null,null,null,null,null,null,null,null,null,null,"",{"$f":"IF(L16='TempO Answers'!B$15,1,0)+IF(M16='TempO Answers'!C$15,1,0)+IF(N16='TempO Answers'!D$15,1,0)+IF(O16='TempO Answers'!E$15,1,0)","v":4},{"$f":"IF(Q16='TempO Answers'!F$15,1,0)+IF(R16='TempO Answers'!G$15,1,0)+IF(S16='TempO Answers'!H$15,1,0)+IF(T16='TempO Answers'!I$15,1,0)","v":4},{"$f":"IF(V16='TempO Answers'!J$15,1,0)+IF(W16='TempO Answers'!K$15,1,0)+IF(X16='TempO Answers'!L$15,1,0)+IF(Y16='TempO Answers'!M$15,1,0)","v":4},{"$f":"IF(AA16='TempO Answers'!N$15,1,0)+IF(AB16='TempO Answers'!O$15,1,0)+IF(AC16='TempO Answers'!P$15,1,0)+IF(AD16='TempO Answers'!Q$15,1,0)","v":4},{"$f":"IF(AF16='TempO Answers'!R$15,1,0)+IF(AG16='TempO Answers'!S$15,1,0)+IF(AH16='TempO Answers'!T$15,1,0)+IF(AI16='TempO Answers'!U$15,1,0)","v":4}]
[11,1,null,null,null,0,{"$f":"'TempO Answers'!$Y$19-F17","v":20},0,{"$f":"G17*'TempO Answers'!$N$7","v":600},9999,null,null,null,null,null,null,null,null,null,null,null,null,null,null,null,null,null,null,null,null,null,null,null,null,null,null,"",{"$f":"IF(L17='TempO Answers'!B$15,1,0)+IF(M17='TempO Answers'!C$15,1,0)+IF(N17='TempO Answers'!D$15,1,0)+IF(O17='TempO Answers'!E$15,1,0)","v":4},{"$f":"IF(Q17='TempO Answers'!F$15,1,0)+IF(R17='TempO Answers'!G$15,1,0)+IF(S17='TempO Answers'!H$15,1,0)+IF(T17='TempO Answers'!I$15,1,0)","v":4},{"$f":"IF(V17='TempO Answers'!J$15,1,0)+IF(W17='TempO Answers'!K$15,1,0)+IF(X17='TempO Answers'!L$15,1,0)+IF(Y17='TempO Answers'!M$15,1,0)","v":4},{"$f":"IF(AA17='TempO Answers'!N$15,1,0)+IF(AB17='TempO Answers'!O$15,1,0)+IF(AC17='TempO Answers'!P$15,1,0)+IF(AD17='TempO Answers'!Q$15,1,0)","v":4},{"$f":"IF(AF17='TempO Answers'!R$15,1,0)+IF(AG17='TempO Answers'!S$15,1,0)+IF(AH17='TempO Answers'!T$15,1,0)+IF(AI17='TempO Answers'!U$15,1,0)","v":4}]
[12,1,null,null,null,0,{"$f":"'TempO Answers'!$Y$19-F18","v":20},0,{"$f":"G18*'TempO Answers'!$N$7","v":600},9999,null,null,null,null,null,null,null,null,null,null,null,null,null,null,null,null,null,null,null,null,null,null,null,null,null,null,"",{"$f":"IF(L18='TempO Answers'!B$15,1,0)+IF(M18='TempO Answers'!C$15,1,0)+IF(N18='TempO Answers'!D$15,1,0)+IF(O18='TempO Answers'!E$15,1,0)","v":4},{"$f":"IF(Q18='TempO Answers'!F$15,1,0)+IF(R18='TempO Answers'!G$15,1,0)+IF(S18='TempO Answers'!H$15,1,0)+IF(T18='TempO Answers'!I$15,1,0)","v":4},{"$f":"IF(V18='TempO Answers'!J$15,1,0)+IF(W18='TempO Answers'!K$15,1,0)+IF(X18='TempO Answers'!L$15,1,0)+IF(Y18='TempO Answers'!M$15,1,0)","v":4},{"$f":"IF(AA18='TempO Answers'!N$15,1,0)+IF(AB18='TempO Answers'!O$15,1,0)+IF(AC18='TempO Answers'!P$15,1,0)+IF(AD18='TempO Answers'!Q$15,1,0)","v":4},{"$f":"IF(AF18='TempO Answers'!R$15,1,0)+IF(AG18='TempO Answers'!S$15,1,0)+IF(AH18='TempO Answers'!T$15,1,0)+IF(AI18='TempO Answers'!U$15,1,0)","v":4}]
[13,1,null,null,null,0,{"$f":"'TempO Answers'!$Y$19-F19","v":20},0,{"$f":"G19*'TempO Answers'!$N$7","v":600},9999,null,null,null,null,null,null,null,null,null,null,null,null,null,null,null,null,null,null,null,null,null,null,null,null,null,null,"",{"$f":"IF(L19='TempO Answers'!B$15,1,0)+IF(M19='TempO Answers'!C$15,1,0)+IF(N19='TempO Answers'!D$15,1,0)+IF(O19='TempO Answers'!E$15,1,0)","v":4},{"$f":"IF(Q19='TempO Answers'!F$15,1,0)+IF(R19='TempO Answers'!G$15,1,0)+IF(S19='TempO Answers'!H$15,1,0)+IF(T19='TempO Answers'!I$15,1,0)","v":4},{"$f":"IF(V19='TempO Answers'!J$15,1,0)+IF(W19='TempO Answers'!K$15,1,0)+IF(X19='TempO Answers'!L$15,1,0)+IF(Y19='TempO Answers'!M$15,1,0)","v":4},{"$f":"IF(AA19='TempO Answers'!N$15,1,0)+IF(AB19='TempO Answers'!O$15,1,0)+IF(AC19='TempO Answers'!P$15,1,0)+IF(AD19='TempO Answers'!Q$15,1,0)","v":4},{"$f":"IF(AF19='TempO Answers'!R$15,1,0)+IF(AG19='TempO Answers'!S$15,1,0)+IF(AH19='TempO Answers'!T$15,1,0)+IF(AI19='TempO Answers'!U$15,1,0)","v":4}]
[14,1,null,null,null,0,{"$f":"'TempO Answers'!$Y$19-F20","v":20},0,{"$f":"G20*'TempO Answers'!$N$7","v":600},9999,null,null,null,null,null,null,null,null,null,null,null,null,null,null,null,null,null,null,null,null,null,null,null,null,null,null,"",{"$f":"IF(L20='TempO Answers'!B$15,1,0)+IF(M20='TempO Answers'!C$15,1,0)+IF(N20='TempO Answers'!D$15,1,0)+IF(O20='TempO Answers'!E$15,1,0)","v":4},{"$f":"IF(Q20='TempO Answers'!F$15,1,0)+IF(R20='TempO Answers'!G$15,1,0)+IF(S20='TempO Answers'!H$15,1,0)+IF(T20='TempO Answers'!I$15,1,0)","v":4},{"$f":"IF(V20='TempO Answers'!J$15,1,0)+IF(W20='TempO Answers'!K$15,1,0)+IF(X20='TempO Answers'!L$15,1,0)+IF(Y20='TempO Answers'!M$15,1,0)","v":4},{"$f":"IF(AA20='TempO Answers'!N$15,1,0)+IF(AB20='TempO Answers'!O$15,1,0)+IF(AC20='TempO Answers'!P$15,1,0)+IF(AD20='TempO Answers'!Q$15,1,0)","v":4},{"$f":"IF(AF20='TempO Answers'!R$15,1,0)+IF(AG20='TempO Answers'!S$15,1,0)+IF(AH20='TempO Answers'!T$15,1,0)+IF(AI20='TempO Answers'!U$15,1,0)","v":4}]
{"$rows_left_out":120}
{"sheet":"Sorted Results","index":2,"n_rows":137,"n_cols":16,"rows_kept":137,"cut":false,"hidden":false,"merged":[[0,7,0,15],[1,7,1,15],[0,3,0,5],[2,13,2,15]]}
[null,"Re-calculated at:",null,{"$f":"NOW()","v":"2018-01-18T17:54:24.310"},null,null,null,{"$f":"T('TempO Answers'!A1)","v":"Type Event Name here"}]
[null,null,null,null,null,null,null,{"$f":"T('TempO Answers'!A2)","v":"Type Event Date here"}]
[null,"Click on the button to refresh and sort results:",null,null,null,null,null,null,null,null,"   Results produced at :",null,null,"2016-01-15T12:52:46.600"]
[null,null,null,null,null,null,null,"Rank","Name","Club","Nation","No. Correct","No. Incorrect","Agg. Time","Penal -ties","Result (sec)"]
[null,null,null,null,null,null,null,1,null,null,null,0,20,0,600,9999]
[null,null,null,null,null,null,null,1,null,null,null,0,20,0,600,9999]
[null,"To print, choose the desired print area by clicking",null,null,null,null,null,1,null,null,null,0,20,0,600,9999]
[null,"on a button below.  Then use the normal Print command.",null,null,null,null,null,1,null,null,null,0,20,0,600,9999]
[null,"Use portrait printing on A4, no reduction.",null,null,null,null,null,1,null,null,null,0,20,0,600,9999]
[null,null,null,null,null,null,null,1,null,null,null,0,20,0,600,9999]
[null,"Select one page print area (top 44):",null,null,null,null,null,1,null,null,null,0,20,0,600,9999]
[null,null,null,null,null,null,null,1,null,null,null,0,20,0,600,9999]
[null,null,null,null,null,null,null,1,null,null,null,0,20,0,600,9999]
[null,null,null,null,null,null,null,1,null,null,null,0,20,0,600,9999]
[null,null,null,null,null,null,null,1,null,null,null,0,20,0,600,9999]
[null,"Select two page print area (top 88):",null,null,null,null,null,1,null,null,null,0,20,0,600,9999]
[null,null,null,null,null,null,null,1,null,null,null,0,20,0,600,9999]
[null,null,null,null,null,null,null,1,null,null,null,0,20,0,600,9999]
[null,null,null,null,null,null,null,1,null,null,null,0,20,0,600,9999]
[null,null,null,null,null,null,null,1,null,null,null,0,20,0,600,9999]
{"$rows_left_out":118}
{"sheet":"Sorted Table","index":3,"n_rows":137,"n_cols":42,"rows_kept":137,"cut":false,"hidden":false,"merged":[[1,37,1,41],[2,13,2,15],[0,3,0,5],[0,7,0,15],[1,7,1,15],[1,17,1,21],[1,22,1,26],[1,27,1,31],[1,32,1,36]]}
[null,"Re-calculated at:",null,{"$f":"NOW()","v":"2018-01-18T17:54:24.310"},null,null,null,{"$f":"T('TempO Answers'!A1)","v":"Type Event Name here"}]
[null,null,null,null,null,null,null,{"$f":"T('TempO Answers'!A2)","v":"Type Event Date here"},null,null,null,null,null,null,null,null,null,"Station 1",null,null,null,null,"Station 2",null,null,null,null,"Station 3",null,null,null,null,"Station 4",null,null,null,null,"Station 5"]
[null,"Click on the button to refresh and sort the full results table:",null,null,null,null,null,null,null,null,"   Results produced at :",null,null,"2016-01-15T12:53:02.480",null,null,null,{"$f":"T('TempO Answers'!B15)","v":""},{"$f":"T('TempO Answers'!C15)","v":""},{"$f":"T('TempO Answers'!D15)","v":""},{"$f":"T('TempO Answers'!E15)","v":""},null,{"$f":"T('TempO Answers'!F15)","v":""},{"$f":"T('TempO Answers'!G15)","v":""},{"$f":"T('TempO Answers'!H15)","v":""},{"$f":"T('TempO Answers'!I15)","v":""},null,{"$f":"T('TempO Answers'!J15)","v":""},{"$f":"T('TempO Answers'!K15)","v":""},{"$f":"T('TempO Answers'!L15)","v":""},{"$f":"T('TempO Answers'!M15)","v":""},null,{"$f":"T('TempO Answers'!N15)","v":""},{"$f":"T('TempO Answers'!O15)","v":""},{"$f":"T('TempO Answers'!P15)","v":""},{"$f":"T('TempO Answers'!Q15)","v":""},null,{"$f":"T('TempO Answers'!R15)","v":""},{"$f":"T('TempO Answers'!S15)","v":""},{"$f":"T('TempO Answers'!T15)","v":""},{"$f":"T('TempO Answers'!U15)","v":""}]
[null,null,null,null,null,null,null,"Rank","Name","Club","Nat.","No. Correct","No. Incorrect","Agg. Time","Penal -ties","Result (sec)",null,1,2,3,4,"Time (sec)",5,6,7,8,"Time (sec)",9,10,11,12,"Time (sec)",13,14,15,16,"Time (sec)",17,18,19,20,"Time (sec)"]
[null,null,null,null,null,null,null,1,null,null,null,0,20,0,600,9999]
[null,null,null,null,null,null,null,1,null,null,null,0,20,0,600,9999]
[null,"To print, choose the desired print area by clicking",null,null,null,null,null,1,null,null,null,0,20,0,600,9999]
[null,"on a button below.  Then use the normal Print command.",null,null,null,null,null,1,null,null,null,0,20,0,600,9999]
[null,"Use landscape printing on A4, with 85% reduction.",null,null,null,null,null,1,null,null,null,0,20,0,600,9999]
[null,null,null,null,null,null,null,1,null,null,null,0,20,0,600,9999]
[null,"Select one page print area (top 33):",null,null,null,null,null,1,null,null,null,0,20,0,600,9999]
[null,null,null,null,null,null,null,1,null,null,null,0,20,0,600,9999]
[null,null,null,null,null,null,null,1,null,null,null,0,20,0,600,9999]
[null,null,null,null,null,null,null,1,null,null,null,0,20,0,600,9999]
[null,"Select two page print area (top 66):",null,null,null,null,null,1,null,null,null,0,20,0,600,9999]
[null,null,null,null,null,null,null,1,null,null,null,0,20,0,600,9999]
[null,null,null,null,null,null,null,1,null,null,null,0,20,0,600,9999]
[null,null,null,null,null,null,null,1,null,null,null,0,20,0,600,9999]
[null,"Select three page print area (top 99):",null,null,null,null,null,1,null,null,null,0,20,0,600,9999]
[null,null,null,null,null,null,null,1,null,null,null,0,20,0,600,9999]
{"$rows_left_out":117}